{"text_format":"1","workbook":"xlsx","n_sheets":34,"sheets":["Acknowledgement","Main Menu","Diagram","User Guide","Scenarios","Program Info","Coverage","CHWs","Medicines & Equipment","Interventions","Management","Supervision","Meetings","Training","Other Costs","Startup","Financing","Dashboard","Summary Tables","Summary Graphs","Budget","Policy","Calculations-Services","Calculations-Total Cost","Calculations-Cost Per Service","Calculations-Financing","Annex A. Caseloads","Annex B. CHW Questionnaires","Annex B1. District","Annex B2. Health Center","Annex B3. CHW","Annex B4. Supervision","Annex B5. Training Meeting","Annex B6. CHW Time"],"not_rendered":{"charts":19,"images":9,"macros":1,"external_links":0,"defined_names":139,"comments":15,"pivot_tables":0},"unopened":[],"bounds":{"document_bytes":16777216,"sheet_cells":100000,"rows_first":2000,"rows_last":500,"rows_between":2000,"halvings":0,"cell_chars":16384,"cell_head_chars":4096},"cells_cut":0,"cells_raw":0,"read":"whole","date_system":"1900"}

{"sheet":"Acknowledgement","index":0,"n_rows":16,"n_cols":3,"rows_kept":16,"cut":false,"hidden":false,"merged":[[0,0,0,20],[11,2,11,18],[1,0,1,20],[3,2,7,18],[15,2,15,18],[13,2,13,18],[9,2,9,18]]}
["iCCM COSTING AND FINANCING TOOL"]
["ACKNOWLEDGEMENT"]
[]
[null,null,"The Integrated Community Case Management (iCCM) Costing and Financing Tool was developed by Management Sciences for Health (MSH), under Subagreement No. FY11-G03-6990 funded by Translating Research into Action (TRAction). The TRAction project is funded by the United States Agency for International Development (USAID) under cooperative agreement number GHS-A-00-09-00015-00. The project team includes prime recipient, University Research Co., LLC (URC), and sub-recipient research organizations, including MSH. "]
[]
[]
{"$rows_left_out":11}
{"sheet":"Main Menu","index":1,"n_rows":2,"n_cols":1,"rows_kept":2,"cut":false,"hidden":false,"merged":[[0,0,0,20],[9,1,9,19],[1,0,1,20]]}
["iCCM COSTING AND FINANCING TOOL"]
["MAIN MENU"]

{"sheet":"Diagram","index":2,"n_rows":4,"n_cols":22,"rows_kept":4,"cut":false,"hidden":false,"merged":[[0,0,0,22],[3,21,3,22],[1,0,1,22]]}
["iCCM COSTING AND FINANCING TOOL"]
["DIAGRAM"]
[]
[null,null,null,null,null,null,null,null,null,null,null,null,null,null,null,null,null,null,null,null,null,"KEY:"]

{"sheet":"User Guide","index":3,"n_rows":92,"n_cols":10,"rows_kept":92,"cut":false,"hidden":false,"merged":[[55,4,55,5],[55,6,55,8],[55,9,55,17],[32,0,32,20],[50,0,50,20],[0,0,0,20],[1,0,1,20],[6,0,6,20],[15,0,15,20],[40,0,40,20],[53,0,53,1],[53,2,53,3],[53,4,53,5],[53,6,53,8],[53,9,53,17],[52,0,52,1],[52,2,52,3],[52,4,52,5],[52,6,52,8],[52,9,52,17],[54,6,54,8],[54,9,54,17],[55,0,55,1],[55,2,55,3],[59,0,59,1],[59,2,59,3],[59,4,59,5],[59,6,59,8],[59,9,59,17],[58,0,58,1],[58,2,58,3],[58,4,58,5],[58,6,58,8],[58,9,58,17],[57,0,57,1],[57,2,57,3],[57,4,57,5],[57,6,57,8],[57,9,57,17],[56,0,56,1],[56,2,56,3],[56,4,56,5],[56,6,56,8],[56,9,56,17],[62,0,62,1],[62,2,62,3],[62,4,62,5],[62,6,62,8],[62,9,62,17],[60,6,60,8],[60,9,60,17],[61,0,61,1],[61,2,61,3],[61,4,61,5],[61,6,61,8],[61,9,61,17],[64,0,64,1],[64,2,64,3],[64,4,64,5],[64,6,64,8],[64,9,64,17],[63,0,63,1],[63,2,63,3],[63,4,63,5],[63,6,63,8],[63,9,63,17],[67,0,67,1],[67,2,67,3],[67,4,67,5],[67,6,67,8],[67,9,67,17],[65,6,65,8],[65,9,65,17],[66,0,66,1],[66,2,66,3],[66,4,66,5],[66,6,66,8],[66,9,66,17],[69,0,69,1],[69,2,69,3],[69,4,69,5],[69,6,69,8],[69,9,69,17],[68,0,68,1],[68,2,68,3],[68,4,68,5],[68,6,68,8],[68,9,68,17],[71,0,71,1],[71,2,71,3],[71,4,71,5],[71,6,71,8],[71,9,71,17],[70,0,70,1],[70,2,70,3],[70,4,70,5],[70,6,70,8],[70,9,70,17],[74,0,74,1],[74,2,74,3],[74,4,74,5],[74,6,74,8],[74,9,74,17],[73,6,73,8],[73,9,73,17],[72,0,72,1],[72,2,72,3],[72,4,72,5],[72,6,72,8],[72,9,72,17],[76,0,76,1],[76,2,76,3],[76,4,76,5],[76,6,76,8],[76,9,76,17],[75,0,75,1],[75,2,75,3],[75,4,75,5],[75,6,75,8],[75,9,75,17],[78,0,78,1],[78,2,78,3],[78,4,78,5],[78,6,78,8],[78,9,78,17],[77,0,77,1],[77,2,77,3],[77,4,77,5],[77,6,77,8],[77,9,77,17],[81,0,81,1],[81,2,81,3],[81,4,81,5],[81,6,81,8],[81,9,81,17],[79,6,79,8],[79,9,79,17],[80,0,80,1],[80,2,80,3],[80,4,80,5],[80,6,80,8],[80,9,80,17],[84,6,84,8],[84,9,84,17],[83,0,83,1],[83,2,83,3],[83,4,83,5],[83,6,83,8],[83,9,83,17],[82,0,82,1],[82,2,82,3],[82,4,82,5],[82,6,82,8],[82,9,82,17],[86,0,86,1],[86,2,86,3],[86,4,86,5],[86,6,86,8],[86,9,86,17],[85,0,85,1],[85,2,85,3],[85,4,85,5],[85,6,85,8],[85,9,85,17],[88,6,88,8],[88,9,88,17],[89,0,89,1],[89,2,89,3],[89,4,89,5],[89,6,89,8],[89,9,89,17],[87,0,87,1],[87,2,87,3],[87,4,87,5],[87,6,87,8],[87,9,87,17],[91,0,91,1],[91,2,91,3],[91,4,91,5],[91,6,91,8],[91,9,91,17],[90,0,90,1],[90,2,90,3],[90,4,90,5],[90,6,90,8],[90,9,90,17]]}
["iCCM COSTING AND FINANCING TOOL"]
["USER GUIDE"]
[]
[]
[]
[]
{"$rows_left_out":87}
{"sheet":"Scenarios","index":4,"n_rows":20,"n_cols":18,"rows_kept":20,"cut":false,"hidden":false,"merged":[[0,0,0,17],[1,0,1,17],[11,12,12,16],[14,12,15,16],[19,12,19,16],[16,17,16,19],[13,12,13,16],[10,12,10,16],[7,12,7,16],[16,12,16,16]]}
["iCCM COSTING AND FINANCING TOOL"]
["SCENARIO SELECTION"]
[]
[]
[]
[]
{"$rows_left_out":15}
{"sheet":"Program Info","index":5,"n_rows":82,"n_cols":8,"rows_kept":82,"cut":false,"hidden":false,"merged":[[14,1,14,2],[16,1,16,2],[17,1,17,2],[19,1,19,2],[9,1,9,2],[10,1,10,2],[11,1,11,2],[12,1,12,2],[13,1,13,2],[18,1,18,2],[20,1,20,2],[22,1,22,2],[24,1,24,2],[26,1,26,2],[23,1,23,2]]}
["iCCM COSTING AND FINANCING TOOL"]
["PROGRAM INFORMATION"]
[]
[]
[]
[]
{"$rows_left_out":77}
{"sheet":"Coverage","index":6,"n_rows":58,"n_cols":20,"rows_kept":58,"cut":false,"hidden":false,"merged":[[55,2,55,3],[56,2,56,3],[57,2,57,3],[50,2,50,3],[51,2,51,3],[52,2,52,3],[53,2,53,3],[54,2,54,3],[8,2,8,4],[26,2,26,4],[47,2,47,3],[48,2,48,3],[49,2,49,3],[10,3,11,3],[10,14,10,19],[9,14,9,19],[10,4,10,9],[28,4,28,9],[45,4,45,9],[28,14,28,19],[27,14,27,19]]}
["iCCM COSTING AND FINANCING TOOL"]
["COVERAGE"]
[]
[]
[]
[]
{"$rows_left_out":53}
{"sheet":"CHWs","index":7,"n_rows":29,"n_cols":4,"rows_kept":29,"cut":false,"hidden":false,"merged":[[12,2,12,3]]}
["iCCM COSTING AND FINANCING TOOL"]
["CHW ASSUMPTIONS"]
[]
[]
[]
[]
{"$rows_left_out":24}
{"sheet":"Medicines & Equipment","index":8,"n_rows":85,"n_cols":16,"rows_kept":85,"cut":false,"hidden":false,"merged":[[36,10,36,15]]}
["iCCM COSTING AND FINANCING TOOL"]
["MEDICINES & EQUIPMENT"]
[]
[]
[]
[]
{"$rows_left_out":80}
{"sheet":"Interventions","index":9,"n_rows":165,"n_cols":9,"rows_kept":165,"cut":false,"hidden":false,"merged":[[87,7,87,8],[103,7,103,8],[119,7,119,8],[135,7,135,8],[151,7,151,8],[7,7,7,8],[23,7,23,8],[39,7,39,8],[55,7,55,8],[71,7,71,8]]}
["iCCM COSTING AND FINANCING TOOL"]
["INTERVENTIONS"]
[]
[]
[]
[]
{"$rows_left_out":160}
{"sheet":"Management","index":10,"n_rows":70,"n_cols":20,"rows_kept":70,"cut":false,"hidden":false,"merged":[[10,5,10,10],[10,13,10,18],[7,8,7,9]]}
["iCCM COSTING AND FINANCING TOOL"]
["PROGRAM MANAGEMENT (SALARY COSTS)"]
[]
[]
[]
[]
{"$rows_left_out":65}
{"sheet":"Supervision","index":11,"n_rows":43,"n_cols":20,"rows_kept":43,"cut":false,"hidden":false,"merged":[[10,5,10,10],[10,13,10,18],[7,8,7,9]]}
["iCCM COSTING AND FINANCING TOOL"]
["SUPERVISION (SALARY COSTS)"]
[]
[]
[]
[]
{"$rows_left_out":38}
{"sheet":"Meetings","index":12,"n_rows":45,"n_cols":26,"rows_kept":45,"cut":false,"hidden":false,"merged":[[8,19,8,24]]}
["iCCM COSTING AND FINANCING TOOL"]
["MEETINGS AND SUPERVISION VISITS"]
[]
[null,null,null,null,null,null,null,null,null,null,null,null,null,null,null,null,null,null,{"$f":"CHW_abbrev&\"s\"","v":"CHWs"},{"$f":"'Calculations-Services'!B155","v":0},{"$f":"'Calculations-Services'!C155","v":0},{"$f":"'Calculations-Services'!D155","v":0},{"$f":"'Calculations-Services'!E155","v":0},{"$f":"'Calculations-Services'!F155","v":0},{"$f":"'Calculations-Services'!G155","v":0}]
[null,null,null,null,null,null,null,null,null,null,null,null,null,null,null,null,null,null,{"$f":"CHW_abbrev&\" supervisors\"","v":"CHW supervisors"},{"$f":"'Calculations-Services'!B156","v":0},{"$f":"'Calculations-Services'!C156","v":0},{"$f":"'Calculations-Services'!D156","v":0},{"$f":"'Calculations-Services'!E156","v":0},{"$f":"'Calculations-Services'!F156","v":0},{"$f":"'Calculations-Services'!G156","v":0}]
[null,null,null,null,null,null,null,null,null,null,null,null,null,null,null,null,null,null,{"$f":"CHW_abbrev &\"s and \"&CHW_abbrev&\" supervisors\"","v":"CHWs and CHW supervisors"},{"$f":"SUM(T4:T5)","v":0},{"$f":"SUM(U4:U5)","v":0},0,0,0,0]
{"$rows_left_out":40}
{"sheet":"Training","index":13,"n_rows":48,"n_cols":38,"rows_kept":48,"cut":false,"hidden":false,"merged":[[8,32,8,37],[25,32,25,37]]}
["iCCM COSTING AND FINANCING TOOL"]
["TRAINING"]
[]
[null,null,null,null,null,null,null,null,null,null,null,null,null,null,null,null,null,null,null,null,null,null,null,{"$f":"CHW_abbrev&\"s\"","v":"CHWs"},{"$f":"'Calculations-Services'!B168","v":0},{"$f":"'Calculations-Services'!C168","v":0},{"$f":"'Calculations-Services'!D168","v":0},{"$f":"'Calculations-Services'!E168","v":0},{"$f":"'Calculations-Services'!F168","v":0},{"$f":"'Calculations-Services'!G168","v":0}]
[null,null,null,null,null,null,null,null,null,null,null,null,null,null,null,null,null,null,null,null,null,null,null,{"$f":"CHW_abbrev&\" supervisors\"","v":"CHW supervisors"},{"$f":"'Calculations-Services'!G156","v":0},{"$f":"IF('Calculations-Services'!C156-'Calculations-Services'!B156<0,0,'Calculations-Services'!C156-'Calculations-Services'!B156)","v":0},{"$f":"IF('Calculations-Services'!D156-'Calculations-Services'!C156<0,0,'Calculations-Services'!D156-'Calculations-Services'!C156)","v":0},{"$f":"IF('Calculations-Services'!E156-'Calculations-Services'!D156<0,0,'Calculations-Services'!E156-'Calculations-Services'!D156)","v":0},{"$f":"IF('Calculations-Services'!F156-'Calculations-Services'!E156<0,0,'Calculations-Services'!F156-'Calculations-Services'!E156)","v":0},{"$f":"IF('Calculations-Services'!G156-'Calculations-Services'!F156<0,0,'Calculations-Services'!G156-'Calculations-Services'!F156)","v":0}]
[null,null,null,null,null,null,null,null,null,null,null,null,null,null,null,null,null,null,null,null,null,null,null,{"$f":"CHW_abbrev &\"s and \"&CHW_abbrev&\" supervisors\"","v":"CHWs and CHW supervisors"},{"$f":"SUM(Y4:Y5)","v":0},{"$f":"SUM(Z4:Z5)","v":0},0,0,0,0]
{"$rows_left_out":43}
{"sheet":"Other Costs","index":14,"n_rows":52,"n_cols":17,"rows_kept":52,"cut":false,"hidden":false,"merged":[[9,10,9,15]]}
["iCCM COSTING AND FINANCING TOOL"]
["OTHER PROGRAM COSTS"]
[]
[]
[]
[]
{"$rows_left_out":47}
{"sheet":"Startup","index":15,"n_rows":45,"n_cols":22,"rows_kept":45,"cut":false,"hidden":false,"merged":[[9,15,9,20],[9,4,9,10]]}
["iCCM COSTING AND FINANCING TOOL"]
["START-UP COSTS"]
[]
[]
[]
[]
{"$rows_left_out":40}
{"sheet":"Financing","index":16,"n_rows":35,"n_cols":10,"rows_kept":35,"cut":false,"hidden":false,"merged":[[9,4,9,9]]}
["iCCM COSTING AND FINANCING TOOL"]
["FINANCING"]
[]
[]
[]
[]
{"$rows_left_out":30}
{"sheet":"Dashboard","index":17,"n_rows":59,"n_cols":62,"rows_kept":59,"cut":false,"hidden":false,"merged":[[9,8,9,13],[7,15,7,20],[8,15,8,20],[9,15,9,20],[0,0,0,20],[1,0,1,20],[2,0,2,20],[8,5,8,6],[7,8,7,13],[8,8,8,13],[41,1,41,6],[41,8,41,13],[11,1,11,6],[11,8,11,13],[11,15,11,20],[26,1,26,6],[26,8,26,13],[26,15,26,20],[41,15,41,20]]}
["iCCM COSTING AND FINANCING TOOL"]
[{"$f":"\"iCCM PROGRAM: COST, FINANCING AND PROGRAM OVERVIEW, \"&country_name&\" (\"&start_date&\" - \"&end_date&\")\"","v":"iCCM PROGRAM: COST, FINANCING AND PROGRAM OVERVIEW,  ( - )"}]
["RESULTS: DASHBOARD"]
[null,null,null,null,null,null,null,null,null,null,null,null,null,null,null,null,null,null,null,null,null,null,null,null,null,"DO NOT DELETE ANY COLUMNS!"]
[]
[]
{"$rows_left_out":54}
{"sheet":"Summary Tables","index":18,"n_rows":145,"n_cols":8,"rows_kept":145,"cut":false,"hidden":false,"merged":[[103,2,103,6],[103,7,104,7],[117,2,117,6],[117,7,118,7],[132,2,132,6],[132,7,133,7],[35,7,36,7],[53,2,53,6],[67,2,67,6],[67,7,68,7],[83,2,83,6],[83,7,84,7],[0,0,0,6],[1,0,1,6],[2,0,2,6],[13,2,13,6],[35,2,35,6]]}
["iCCM COSTING AND FINANCING TOOL"]
[{"$f":"\"iCCM PROGRAM: COST, FINANCING AND PROGRAM OVERVIEW, \"&country_name&\" (\"&start_date&\" - \"&end_date&\")\"","v":"iCCM PROGRAM: COST, FINANCING AND PROGRAM OVERVIEW,  ( - )"}]
["RESULTS: SUMMARY TABLES"]
[]
[]
[]
{"$rows_left_out":140}
{"sheet":"Summary Graphs","index":19,"n_rows":264,"n_cols":15,"rows_kept":264,"cut":false,"hidden":false,"merged":[[10,10,10,13],[10,14,10,18],[2,0,2,19],[1,0,1,19],[0,0,0,19],[10,0,10,3],[10,4,10,8]]}
["iCCM COSTING AND FINANCING TOOL"]
[{"$f":"\"iCCM PROGRAM: COST, FINANCING AND PROGRAM OVERVIEW, \"&country_name&\" (\"&start_date&\" - \"&end_date&\")\"","v":"iCCM PROGRAM: COST, FINANCING AND PROGRAM OVERVIEW,  ( - )"}]
["RESULTS : SUMMARY GRAPHS"]
[]
[]
[]
{"$rows_left_out":259}
{"sheet":"Budget","index":20,"n_rows":25,"n_cols":27,"rows_kept":25,"cut":false,"hidden":false,"merged":[[0,0,0,6],[1,0,1,6],[2,0,2,6]]}
["iCCM COSTING AND FINANCING TOOL"]
[{"$f":"\"iCCM PROGRAM: COST, FINANCING AND PROGRAM OVERVIEW, \"&country_name&\" (\"&start_date&\" - \"&end_date&\")\"","v":"iCCM PROGRAM: COST, FINANCING AND PROGRAM OVERVIEW,  ( - )"}]
["LINE ITEM BUDGET"]
[null,null,null,null,null,null,null,null,null,null,null,null,null,null,null,null,null,null,null,null,null,null,null,null,null,null,"DO NOT DELETE ANY COLUMNS!"]
[]
[]
{"$rows_left_out":20}
{"sheet":"Policy","index":21,"n_rows":16,"n_cols":28,"rows_kept":16,"cut":false,"hidden":false,"merged":[[7,1,7,10],[8,1,8,9],[8,11,8,19],[9,1,9,9],[10,1,10,9],[0,0,0,19],[1,0,1,19],[2,0,2,19],[7,11,7,19],[15,1,15,9],[9,11,9,19],[10,11,10,19],[11,11,11,19],[12,11,12,19],[13,11,13,19],[14,11,14,19],[15,11,15,19],[11,1,11,9],[12,1,12,9],[13,1,13,9],[14,1,14,9]]}
["iCCM COSTING AND FINANCING TOOL"]
[{"$f":"\"iCCM PROGRAM: COST, FINANCING AND PROGRAM OVERVIEW, \"&country_name&\" (\"&start_date&\" - \"&end_date&\")\"","v":"iCCM PROGRAM: COST, FINANCING AND PROGRAM OVERVIEW,  ( - )"}]
["POLICY QUESTIONS"]
[null,null,null,null,null,null,null,null,null,null,null,null,null,null,null,null,null,null,null,null,null,null,null,null,null,null,null,"DO NOT DELETE ANY COLUMNS!"]
[]
[]
{"$rows_left_out":11}
{"sheet":"Calculations-Services","index":22,"n_rows":194,"n_cols":8,"rows_kept":194,"cut":false,"hidden":false,"merged":[[0,0,0,6],[1,0,1,6]]}
["iCCM COSTING AND FINANCING TOOL"]
[{"$f":"\"CALCULATIONS - SERVICES AND \"&CHW_abbrev&\"s\"","v":"CALCULATIONS - SERVICES AND CHWs"}]
["Geographic Coverage Scenario:","Baseline + Target Geographic Coverage","Target Geographic Coverage","Full-Scale Geographic Coverage",{"$f":"scenario2","v":"Baseline + Target Geographic Coverage"},{"$f":"IF(scenario2=\"Baseline + Target Geographic Coverage\",1,IF(scenario2=\"Target Geographic Coverage\",3,IF(scenario2=\"Full-Scale Geographic Coverage\",5)))","v":1}]
["Service Delivery Coverage Scenario: ","Baseline + Target Service Delivery Coverage","Target Service Delivery Coverage","Full-Scale Service Delivery Coverage",{"$f":"scenario3","v":"Baseline + Target Service Delivery Coverage"},{"$f":"IF(scenario3=\"Baseline + Target Service Delivery Coverage\",2,IF(scenario3=\"Target Service Delivery Coverage\",7,IF(scenario3=\"Full-Scale Service Delivery Coverage\",10)))","v":2}]
[null,2,7,10,null,{"$f":"SUM(F3:F4)","v":3}]
[]
{"$rows_left_out":189}
{"sheet":"Calculations-Total Cost","index":23,"n_rows":218,"n_cols":9,"rows_kept":218,"cut":false,"hidden":false,"merged":[[0,0,0,6],[1,0,1,6]]}
["iCCM COSTING AND FINANCING TOOL"]
[{"$f":"\"CALCULATIONS - TOTAL RECURRENT AND STARTUP COST (\"&currency_selection&\")\"","v":"CALCULATIONS - TOTAL RECURRENT AND STARTUP COST (USD)"}]
["Geographic Coverage Scenario:","Baseline + Target Geographic Coverage","Target Geographic Coverage","Full-Scale Geographic Coverage",{"$f":"scenario2","v":"Baseline + Target Geographic Coverage"},null,{"$f":"currency","v":0}]
["Service Delivery Coverage Scenario: ","Baseline + Target Service Delivery Coverage","Target Service Delivery Coverage","Full-Scale Service Delivery Coverage",{"$f":"scenario3","v":"Baseline + Target Service Delivery Coverage"},null,{"$f":"\"USD\"","v":"USD"}]
[]
[]
{"$rows_left_out":213}
{"sheet":"Calculations-Cost Per Service","index":24,"n_rows":245,"n_cols":8,"rows_kept":245,"cut":false,"hidden":false,"merged":[[0,0,0,7],[1,0,1,7]]}
["iCCM COSTING AND FINANCING TOOL"]
[{"$f":"\"CALCULATIONS - COST PER SERVICE (\"&currency_selection&\")\"","v":"CALCULATIONS - COST PER SERVICE (USD)"}]
["Geographic Coverage Scenario:","Actual Geographic Coverage","Target Geographic Coverage","Full-Scale Geographic Coverage",{"$f":"scenario2","v":"Baseline + Target Geographic Coverage"},null,{"$f":"currency","v":0}]
["Service Delivery Coverage Scenario: ","Actual Service Delivery Coverage","Target Service Delivery Coverage","Full-Scale Service Delivery Coverage",{"$f":"scenario3","v":"Baseline + Target Service Delivery Coverage"},null,{"$f":"\"USD\"","v":"USD"}]
[]
[]
{"$rows_left_out":240}
{"sheet":"Calculations-Financing","index":25,"n_rows":64,"n_cols":8,"rows_kept":64,"cut":false,"hidden":false,"merged":[[0,0,0,7],[1,0,1,7]]}
["iCCM COSTING AND FINANCING TOOL"]
[{"$f":"\"FINANCING (\"&currency_selection&\")\"","v":"FINANCING (USD)"}]
[]
[]
[]
[]
{"$rows_left_out":59}
{"sheet":"Annex A. Caseloads","index":26,"n_rows":2,"n_cols":1,"rows_kept":2,"cut":false,"hidden":false,"merged":[]}
["iCCM COSTING AND FINANCING TOOL"]
["ANNEX A: CASELOADS"]

{"sheet":"Annex B. CHW Questionnaires","index":27,"n_rows":13,"n_cols":2,"rows_kept":13,"cut":false,"hidden":false,"merged":[]}
["iCCM COSTING AND FINANCING TOOL"]
["ANNEX B: CHW QUESTIONNAIRES"]
[]
["The following sample questionnaires are included:"]
[]
["1)","District Questionnaire"]
{"$rows_left_out":8}
{"sheet":"Annex B1. District","index":28,"n_rows":38,"n_cols":4,"rows_kept":38,"cut":false,"hidden":false,"merged":[]}
["ANNEX B1. DISTRICT QUESTIONNAIRE"]
[]
[null,"Date of interview:"]
[null,"Name of interviewer:"]
[null,"Location of interview:"]
[]
{"$rows_left_out":33}
{"sheet":"Annex B2. Health Center","index":29,"n_rows":39,"n_cols":12,"rows_kept":39,"cut":false,"hidden":false,"merged":[]}
["ANNEX B2. HEALTH CENTER QUESTIONNAIRE",null,{"$f":"C9","v":0},{"$f":"D9","v":0},0,0,0,0,0,0,0,0]
[]
[null,"Date of interview:"]
[null,"Name of interviewer:"]
[null,"Location of interview:"]
[]
{"$rows_left_out":34}
{"sheet":"Annex B3. CHW","index":30,"n_rows":128,"n_cols":44,"rows_kept":128,"cut":false,"hidden":false,"merged":[]}
["ANNEX B3. COMMUNITY HEALTH WORKER (CHW) QUESTIONNAIRES"]
[null,"CHW #",0,0,0,0,0,0,0,0,0,0,0,0,0,0,0,0,0,0,0,0,0,0,0,0,0,0,0,0,0,0,0,0,0,0,0,0,0,0,0,0,null,"AVERAGE"]
[null,"Date of interview:"]
[null,"name of interviewer:"]
[null,"Location of interview:"]
[null,"Start time of the interview:"]
{"$rows_left_out":123}
{"sheet":"Annex B4. Supervision","index":31,"n_rows":53,"n_cols":9,"rows_kept":53,"cut":false,"hidden":false,"merged":[]}
["ANNEX B4: SUPERVISION"]
[]
[null,"Level (District or Health Center)","Name of District or Health Center","Title / Function ","# Staff per Administrative Level","Grade","Years of service","Monthly salary","% of time spent on iCCM"]
[1]
[2]
[3]
{"$rows_left_out":48}
{"sheet":"Annex B5. Training Meeting","index":32,"n_rows":53,"n_cols":8,"rows_kept":53,"cut":false,"hidden":false,"merged":[]}
["ANNEX B5. MEETINGS AND TRAININGS"]
[]
[null,null,"Description of meeting or training","Funded by","Location / level (district, health center)","Frequency (quarterly, annually, etc.)","Length of session (days)","Amount of money provided to each CHW"]
["STARTUP TRAINING"]
[null,1]
[null,2]
{"$rows_left_out":48}
{"sheet":"Annex B6. CHW Time","index":33,"n_rows":31,"n_cols":282,"rows_kept":31,"cut":false,"hidden":false,"merged":[]}
["ANNEX B6. CHW TIME "]
[]
[null,"NAME OF CHW:",0,0,null,null,null,null,null,0,0,null,null,null,null,null,0,0,null,null,null,null,null,0,0,null,null,null,null,null,0,0,null,null,null,null,null,0,0,null,null,null,null,null,0,0,null,null,null,null,null,0,0,null,null,null,null,null,0,0,null,null,null,null,null,0,0,null,null,null,null,null,0,0,null,null,null,null,null,0,0,null,null,null,null,null,0,0,null,null,null,null,null,0,0,null,null,null,null,null,0,0,null,null,null,null,null,0,0,null,null,null,null,null,0,0,null,null,null,null,null,0,0,null,null,null,null,null,0,0,null,null,null,null,null,0,0,null,null,null,null,null,0,0,null,null,null,null,null,0,0,null,null,null,null,null,0,0,null,null,null,null,null,0,0,null,null,null,null,null,0,0,null,null,null,null,null,0,0,null,null,null,null,null,0,0,null,null,null,null,null,0,0,null,null,null,null,null,0,0,null,null,null,null,null,0,0,null,null,null,null,null,0,0,null,null,null,null,null,0,0,null,null,null,null,null,0,0,null,null,null,null,null,0,0,null,null,null,null,null,0,0,null,null,null,null,null,0,0,null,null,null,null,null,0,0,null,null,null,null,null,0,0,null,null,null,null,null,0,0,null,null,null,null,null,0,0]
[null,null,"Monday","Tuesday","Wednesday","Thursday","Friday","Saturday","Sunday","Monday","Tuesday","Wednesday","Thursday","Friday","Saturday","Sunday","Monday","Tuesday","Wednesday","Thursday","Friday","Saturday","Sunday","Monday","Tuesday","Wednesday","Thursday","Friday","Saturday","Sunday","Monday","Tuesday","Wednesday","Thursday","Friday","Saturday","Sunday","Monday","Tuesday","Wednesday","Thursday","Friday","Saturday","Sunday","Monday","Tuesday","Wednesday","Thursday","Friday","Saturday","Sunday","Monday","Tuesday","Wednesday","Thursday","Friday","Saturday","Sunday","Monday","Tuesday","Wednesday","Thursday","Friday","Saturday","Sunday","Monday","Tuesday","Wednesday","Thursday","Friday","Saturday","Sunday","Monday","Tuesday","Wednesday","Thursday","Friday","Saturday","Sunday","Monday","Tuesday","Wednesday","Thursday","Friday","Saturday","Sunday","Monday","Tuesday","Wednesday","Thursday","Friday","Saturday","Sunday","Monday","Tuesday","Wednesday","Thursday","Friday","Saturday","Sunday","Monday","Tuesday","Wednesday","Thursday","Friday","Saturday","Sunday","Monday","Tuesday","Wednesday","Thursday","Friday","Saturday","Sunday","Monday","Tuesday","Wednesday","Thursday","Friday","Saturday","Sunday","Monday","Tuesday","Wednesday","Thursday","Friday","Saturday","Sunday","Monday","Tuesday","Wednesday","Thursday","Friday","Saturday","Sunday","Monday","Tuesday","Wednesday","Thursday","Friday","Saturday","Sunday","Monday","Tuesday","Wednesday","Thursday","Friday","Saturday","Sunday","Monday","Tuesday","Wednesday","Thursday","Friday","Saturday","Sunday","Monday","Tuesday","Wednesday","Thursday","Friday","Saturday","Sunday","Monday","Tuesday","Wednesday","Thursday","Friday","Saturday","Sunday","Monday","Tuesday","Wednesday","Thursday","Friday","Saturday","Sunday","Monday","Tuesday","Wednesday","Thursday","Friday","Saturday","Sunday","Monday","Tuesday","Wednesday","Thursday","Friday","Saturday","Sunday","Monday","Tuesday","Wednesday","Thursday","Friday","Saturday","Sunday","Monday","Tuesday","Wednesday","Thursday","Friday","Saturday","Sunday","Monday","Tuesday","Wednesday","Thursday","Friday","Saturday","Sunday","Monday","Tuesday","Wednesday","Thursday","Friday","Saturday","Sunday","Monday","Tuesday","Wednesday","Thursday","Friday","Saturday","Sunday","Monday","Tuesday","Wednesday","Thursday","Friday","Saturday","Sunday","Monday","Tuesday","Wednesday","Thursday","Friday","Saturday","Sunday","Monday","Tuesday","Wednesday","Thursday","Friday","Saturday","Sunday","Monday","Tuesday","Wednesday","Thursday","Friday","Saturday","Sunday","Monday","Tuesday","Wednesday","Thursday","Friday","Saturday","Sunday","Monday","Tuesday","Wednesday","Thursday","Friday","Saturday","Sunday","Monday","Tuesday","Wednesday","Thursday","Friday","Saturday","Sunday","Monday","Tuesday","Wednesday","Thursday","Friday","Saturday","Sunday"]
[null,"iCCM"]
[null,"treatment provided at the CHW household"]
{"$rows_left_out":25}